我使用npm install mongojs
来获取包装器,但是在尝试运行时
我的应用程序我收到以下错误:
node.js:195
throw e; // process.nextTick error, or 'error' event on first tick
^
Native bson parser not compiled, please compile or avoid using native_parser=true
然后我尝试从github获取源代码并编译node-mongodb- 我自己。然后在运行make时出现以下错误:
make -C ./external-libs/bson
make[1]: Entering directory`/tmp/node-mongodb-native/external-libs/bson`
rm -rf build.lock-wscript bson.node node-waf configure build
Checking for program g++ or c++: /usr/bin/g++
Checking for program cpp: /usr/bin/cpp
Checking for program ar: /usr/bin/ar
Checking for program ranlib: /usr/bin/ranlib
Checking for g++: ok
Checking for node path: not found
Checking for node prefix: ok
/usr/local 'configure' finished successfully (0.069s)
Waf: Entering directory `/tmp/node-mongodb-native/external-libs/bson/build'
[1/9] cxx: bson.cc -> build/default/bson_1.o
[2/9] cxx: long.cc -> build/default/long_1.o
[3/9] cxx: objectid.cc -> build/default/objectid_1.o
[4/9] cxx: binary.cc -> build/default/binary_1.o
[5/9] cxx: code.cc -> build/default/code_1.o
[6/9] cxx: dbref.cc -> build/default/dbref_1.o
../bson.cc:7:25: fatal error: node_events.h: No such file or directory
compilation terminated.
../objectid.cc:6:25: fatal error: node_events.h: No such file or directory
compilation terminated.
../code.cc:6:25: fatal error: node_events.h: No such file or directory
compilation terminated.
../dbref.cc:6:25: fatal error: node_events.h: No such file or directory
compilation terminated.
../long.cc:6:25: fatal error: node_events.h: No such file or directory
compilation terminated.
../binary.cc:7:25: fatal error: node_events.h: No such file or directory
compilation terminated.
Waf: Leaving directory `/tmp/node-mongodb-native/external-libs/bson/build'
Build failed: -> task failed (err #1):
{task: cxx objectid.cc -> objectid_1.o} -> task failed (err#1):
{task: cxx bson.cc -> bson_1.o} -> task failed (err #1):
{task: cxx code.cc -> code_1.o} -> task failed (err #1):
{task: cxx dbref.cc -> dbref_1.o} -> task failed (err #1):
{task: cxx long.cc -> long_1.o} -> task failed (err #1):
{task: cxx binary.cc -> binary_1.o} make[1]: *** [all] Error 1
make[1]: Leaving directory `/tmp/node-mongodb-native/external-libs/bson'
make: *** [build_native] Error 2
为什么会失败以及如何让它发挥作用的任何想法?
答案 0 :(得分:1)
Auteur: Ryan Dahl <ry@tinyclouds.org> 2011-07-19 10:46:38
Auteur du commit: Ryan Dahl <ry@tinyclouds.org> 2011-07-19 10:46:38
Parent: 0a3fc1d9c8becc32c63ae736ca2b3719a3d03c5b (Remove StatWatcher's dep on C++ EventEmitter)
Enfant: 061ce7b0ac370c8a5ae93d95ab7da171cbd488f0 (net_uv: Fix simple/test-http-expect-continue.js)
Branche: master, remotes/origin/master
Suit: v0.5.1
Précède: v0.5.2
Finally remove node::EventEmitter
答案 1 :(得分:0)
我认为您需要在.bashrc或者文件中添加Node到您的PATH,具体取决于您的发行版。
请参阅此链接:http://shapeshed.com/journal/setting-up-nodejs-and-npm-on-mac-osx/
答案 2 :(得分:0)
没有这样的文件或目录编译终止错误可能意味着您尚未创建MongoDB要使用的数据/ db目录。
$ sudo mkdir -p /data/db/
$ sudo chown `id -u` /data/db
当我尝试使用shell连接到MongoDB时,我似乎记得看到类似的东西。你能用shell连接???
答案 3 :(得分:0)
Softwarepadawan,请升级到最新版本的Mongjs。今天下午我推了一个修复它的提交,并使用JS解析器而不是本机解析器。