有人可以帮助我吗?我想出口excel。这是我的控制器代码
Waiting for operation to complete...
........
[ERROR]
[ERROR] Nexus Staging Rules Failure Report
[ERROR] ==================================
[ERROR]
[ERROR] Repository "comgithubburningwave-1004" failures
[ERROR] Rule "profile-target-matching-staging" failures
[ERROR] * Profile target mismatch: /archetype-catalog.xml
[ERROR]
[ERROR]
[INFO] ------------------------------------------------------------------------
[INFO] BUILD FAILURE
[INFO] ------------------------------------------------------------------------
[INFO] Total time: 05:08 min
[INFO] Finished at: 2018-12-12T09:51:14+01:00
[INFO] ------------------------------------------------------------------------
[ERROR] Failed to execute goal org.sonatype.plugins:nexus-staging-maven-plugin:1.6.7:deploy (injected-nexus-deploy) on project bw-core: Could not perform action: there are failing staging rules!: Staging rules failure! -> [Help 1]
[ERROR]
[ERROR] To see the full stack trace of the errors, re-run Maven with the -e switch.
[ERROR] Re-run Maven using the -X switch to enable full debug logging.
[ERROR]
[ERROR] For more information about the errors and possible solutions, please read the following articles:
[ERROR] [Help 1] http://cwiki.apache.org/confluence/display/MAVEN/MojoExecutionException
[INFO] ------------------------------------------------------------------------
[INFO] BUILD FAILURE
[INFO] ------------------------------------------------------------------------
[INFO] Total time: 05:17 min
[INFO] Finished at: 2018-12-12T09:51:14+01:00
[INFO] ------------------------------------------------------------------------
[ERROR] Failed to execute goal org.apache.maven.plugins:maven-release-plugin:2.5.3:perform (default-cli) on project bw-core: Maven execution failed, exit code: '1' -> [Help 1]
org.apache.maven.lifecycle.LifecycleExecutionException: Failed to execute goal org.apache.maven.plugins:maven-release-plugin:2.5.3:perform (default-cli) on project bw-core: Maven execution failed, exit code: '1'
at org.apache.maven.lifecycle.internal.MojoExecutor.execute (MojoExecutor.java:213)
at org.apache.maven.lifecycle.internal.MojoExecutor.execute (MojoExecutor.java:154)
at org.apache.maven.lifecycle.internal.MojoExecutor.execute (MojoExecutor.java:146)
at org.apache.maven.lifecycle.internal.LifecycleModuleBuilder.buildProject (LifecycleModuleBuilder.java:117)
at org.apache.maven.lifecycle.internal.LifecycleModuleBuilder.buildProject (LifecycleModuleBuilder.java:81)
at org.apache.maven.lifecycle.internal.builder.singlethreaded.SingleThreadedBuilder.build (SingleThreadedBuilder.java:56)
at org.apache.maven.lifecycle.internal.LifecycleStarter.execute (LifecycleStarter.java:128)
at org.apache.maven.DefaultMaven.doExecute (DefaultMaven.java:305)
at org.apache.maven.DefaultMaven.doExecute (DefaultMaven.java:192)
at org.apache.maven.DefaultMaven.execute (DefaultMaven.java:105)
at org.apache.maven.cli.MavenCli.execute (MavenCli.java:956)
at org.apache.maven.cli.MavenCli.doMain (MavenCli.java:290)
at org.apache.maven.cli.MavenCli.main (MavenCli.java:194)
at sun.reflect.NativeMethodAccessorImpl.invoke0 (Native Method)
at sun.reflect.NativeMethodAccessorImpl.invoke (NativeMethodAccessorImpl.java:62)
at sun.reflect.DelegatingMethodAccessorImpl.invoke (DelegatingMethodAccessorImpl.java:43)
at java.lang.reflect.Method.invoke (Method.java:498)
at org.codehaus.plexus.classworlds.launcher.Launcher.launchEnhanced (Launcher.java:289)
at org.codehaus.plexus.classworlds.launcher.Launcher.launch (Launcher.java:229)
at org.codehaus.plexus.classworlds.launcher.Launcher.mainWithExitCode (Launcher.java:415)
at org.codehaus.plexus.classworlds.launcher.Launcher.main (Launcher.java:356)
Caused by: org.apache.maven.plugin.MojoExecutionException: Maven execution failed, exit code: '1'
at org.apache.maven.plugins.release.PerformReleaseMojo.execute (PerformReleaseMojo.java:204)
at org.apache.maven.plugin.DefaultBuildPluginManager.executeMojo (DefaultBuildPluginManager.java:137)
at org.apache.maven.lifecycle.internal.MojoExecutor.execute (MojoExecutor.java:208)
at org.apache.maven.lifecycle.internal.MojoExecutor.execute (MojoExecutor.java:154)
at org.apache.maven.lifecycle.internal.MojoExecutor.execute (MojoExecutor.java:146)
at org.apache.maven.lifecycle.internal.LifecycleModuleBuilder.buildProject (LifecycleModuleBuilder.java:117)
at org.apache.maven.lifecycle.internal.LifecycleModuleBuilder.buildProject (LifecycleModuleBuilder.java:81)
at org.apache.maven.lifecycle.internal.builder.singlethreaded.SingleThreadedBuilder.build (SingleThreadedBuilder.java:56)
at org.apache.maven.lifecycle.internal.LifecycleStarter.execute (LifecycleStarter.java:128)
at org.apache.maven.DefaultMaven.doExecute (DefaultMaven.java:305)
at org.apache.maven.DefaultMaven.doExecute (DefaultMaven.java:192)
at org.apache.maven.DefaultMaven.execute (DefaultMaven.java:105)
at org.apache.maven.cli.MavenCli.execute (MavenCli.java:956)
at org.apache.maven.cli.MavenCli.doMain (MavenCli.java:290)
at org.apache.maven.cli.MavenCli.main (MavenCli.java:194)
at sun.reflect.NativeMethodAccessorImpl.invoke0 (Native Method)
at sun.reflect.NativeMethodAccessorImpl.invoke (NativeMethodAccessorImpl.java:62)
at sun.reflect.DelegatingMethodAccessorImpl.invoke (DelegatingMethodAccessorImpl.java:43)
at java.lang.reflect.Method.invoke (Method.java:498)
at org.codehaus.plexus.classworlds.launcher.Launcher.launchEnhanced (Launcher.java:289)
at org.codehaus.plexus.classworlds.launcher.Launcher.launch (Launcher.java:229)
at org.codehaus.plexus.classworlds.launcher.Launcher.mainWithExitCode (Launcher.java:415)
at org.codehaus.plexus.classworlds.launcher.Launcher.main (Launcher.java:356)
Caused by: org.apache.maven.shared.release.ReleaseExecutionException: Maven execution failed, exit code: '1'
at org.apache.maven.shared.release.phase.AbstractRunGoalsPhase.execute (AbstractRunGoalsPhase.java:91)
at org.apache.maven.shared.release.phase.RunPerformGoalsPhase.runLogic (RunPerformGoalsPhase.java:135)
at org.apache.maven.shared.release.phase.RunPerformGoalsPhase.execute (RunPerformGoalsPhase.java:46)
at org.apache.maven.shared.release.DefaultReleaseManager.perform (DefaultReleaseManager.java:429)
at org.apache.maven.shared.release.DefaultReleaseManager.perform (DefaultReleaseManager.java:381)
at org.apache.maven.plugins.release.PerformReleaseMojo.execute (PerformReleaseMojo.java:200)
at org.apache.maven.plugin.DefaultBuildPluginManager.executeMojo (DefaultBuildPluginManager.java:137)
at org.apache.maven.lifecycle.internal.MojoExecutor.execute (MojoExecutor.java:208)
at org.apache.maven.lifecycle.internal.MojoExecutor.execute (MojoExecutor.java:154)
at org.apache.maven.lifecycle.internal.MojoExecutor.execute (MojoExecutor.java:146)
at org.apache.maven.lifecycle.internal.LifecycleModuleBuilder.buildProject (LifecycleModuleBuilder.java:117)
at org.apache.maven.lifecycle.internal.LifecycleModuleBuilder.buildProject (LifecycleModuleBuilder.java:81)
at org.apache.maven.lifecycle.internal.builder.singlethreaded.SingleThreadedBuilder.build (SingleThreadedBuilder.java:56)
at org.apache.maven.lifecycle.internal.LifecycleStarter.execute (LifecycleStarter.java:128)
at org.apache.maven.DefaultMaven.doExecute (DefaultMaven.java:305)
at org.apache.maven.DefaultMaven.doExecute (DefaultMaven.java:192)
at org.apache.maven.DefaultMaven.execute (DefaultMaven.java:105)
at org.apache.maven.cli.MavenCli.execute (MavenCli.java:956)
at org.apache.maven.cli.MavenCli.doMain (MavenCli.java:290)
at org.apache.maven.cli.MavenCli.main (MavenCli.java:194)
at sun.reflect.NativeMethodAccessorImpl.invoke0 (Native Method)
at sun.reflect.NativeMethodAccessorImpl.invoke (NativeMethodAccessorImpl.java:62)
at sun.reflect.DelegatingMethodAccessorImpl.invoke (DelegatingMethodAccessorImpl.java:43)
at java.lang.reflect.Method.invoke (Method.java:498)
at org.codehaus.plexus.classworlds.launcher.Launcher.launchEnhanced (Launcher.java:289)
at org.codehaus.plexus.classworlds.launcher.Launcher.launch (Launcher.java:229)
at org.codehaus.plexus.classworlds.launcher.Launcher.mainWithExitCode (Launcher.java:415)
at org.codehaus.plexus.classworlds.launcher.Launcher.main (Launcher.java:356)
Caused by: org.apache.maven.shared.release.exec.MavenExecutorException: Maven execution failed, exit code: '1'
at org.apache.maven.shared.release.exec.ForkedMavenExecutor.executeGoals (ForkedMavenExecutor.java:151)
at org.apache.maven.shared.release.exec.AbstractMavenExecutor.executeGoals (AbstractMavenExecutor.java:114)
at org.apache.maven.shared.release.phase.AbstractRunGoalsPhase.execute (AbstractRunGoalsPhase.java:85)
at org.apache.maven.shared.release.phase.RunPerformGoalsPhase.runLogic (RunPerformGoalsPhase.java:135)
at org.apache.maven.shared.release.phase.RunPerformGoalsPhase.execute (RunPerformGoalsPhase.java:46)
at org.apache.maven.shared.release.DefaultReleaseManager.perform (DefaultReleaseManager.java:429)
at org.apache.maven.shared.release.DefaultReleaseManager.perform (DefaultReleaseManager.java:381)
at org.apache.maven.plugins.release.PerformReleaseMojo.execute (PerformReleaseMojo.java:200)
at org.apache.maven.plugin.DefaultBuildPluginManager.executeMojo (DefaultBuildPluginManager.java:137)
at org.apache.maven.lifecycle.internal.MojoExecutor.execute (MojoExecutor.java:208)
at org.apache.maven.lifecycle.internal.MojoExecutor.execute (MojoExecutor.java:154)
at org.apache.maven.lifecycle.internal.MojoExecutor.execute (MojoExecutor.java:146)
at org.apache.maven.lifecycle.internal.LifecycleModuleBuilder.buildProject (LifecycleModuleBuilder.java:117)
at org.apache.maven.lifecycle.internal.LifecycleModuleBuilder.buildProject (LifecycleModuleBuilder.java:81)
at org.apache.maven.lifecycle.internal.builder.singlethreaded.SingleThreadedBuilder.build (SingleThreadedBuilder.java:56)
at org.apache.maven.lifecycle.internal.LifecycleStarter.execute (LifecycleStarter.java:128)
at org.apache.maven.DefaultMaven.doExecute (DefaultMaven.java:305)
at org.apache.maven.DefaultMaven.doExecute (DefaultMaven.java:192)
at org.apache.maven.DefaultMaven.execute (DefaultMaven.java:105)
at org.apache.maven.cli.MavenCli.execute (MavenCli.java:956)
at org.apache.maven.cli.MavenCli.doMain (MavenCli.java:290)
at org.apache.maven.cli.MavenCli.main (MavenCli.java:194)
at sun.reflect.NativeMethodAccessorImpl.invoke0 (Native Method)
at sun.reflect.NativeMethodAccessorImpl.invoke (NativeMethodAccessorImpl.java:62)
at sun.reflect.DelegatingMethodAccessorImpl.invoke (DelegatingMethodAccessorImpl.java:43)
at java.lang.reflect.Method.invoke (Method.java:498)
at org.codehaus.plexus.classworlds.launcher.Launcher.launchEnhanced (Launcher.java:289)
at org.codehaus.plexus.classworlds.launcher.Launcher.launch (Launcher.java:229)
at org.codehaus.plexus.classworlds.launcher.Launcher.mainWithExitCode (Launcher.java:415)
at org.codehaus.plexus.classworlds.launcher.Launcher.main (Launcher.java:356)
[ERROR]
[ERROR]
[ERROR] For more information about the errors and possible solutions, please read the following articles:
[ERROR] [Help 1] http://cwiki.apache.org/confluence/display/MAVEN/MojoExecutionException
但是它不返回Excel文件。 这样返回,而不是一个excel文件
我该怎么办?请有人帮我解决这个问题。.谢谢高级
答案 0 :(得分:0)
已解决。.这是因为在返回数据表的资源根与我的导出路由之间的冗余路由。