npm安装面临失败

时间:2020-10-06 16:30:51

标签: node.js opencv npm

> opencv@5.0.0 install /Users/vai/Documents/jobs/Test/Brezaa/node_modules/faced/node_modules/opencv
> node-pre-gyp install --fallback-to-build

node-pre-gyp info it worked if it ends with ok
node-pre-gyp verb cli [
node-pre-gyp verb cli   '/usr/local/Cellar/node/14.13.0/bin/node',
node-pre-gyp verb cli   '/Users/vai/Documents/jobs/Test/Brezaa/node_modules/faced/node_modules/opencv/node_modules/.bin/node-pre-gyp',
node-pre-gyp verb cli   'install',
node-pre-gyp verb cli   '--fallback-to-build'
node-pre-gyp verb cli ]
node-pre-gyp info using node-pre-gyp@0.6.17
node-pre-gyp info using node@14.13.0 | darwin | x64
node-pre-gyp verb command install []
node-pre-gyp info check checked for "/Users/vai/Documents/jobs/Test/Brezaa/node_modules/faced/node_modules/opencv/build/opencv/v5.0.0/Release/node-v83-darwin-x64/opencv.node" (not found)
node-pre-gyp http GET https://node-opencv.s3.amazonaws.com/opencv/v5.0.0/Release/node-v83-darwin-x64.tar.gz
node-pre-gyp http 403 https://node-opencv.s3.amazonaws.com/opencv/v5.0.0/Release/node-v83-darwin-x64.tar.gz
node-pre-gyp http 403 status code downloading tarball https://node-opencv.s3.amazonaws.com/opencv/v5.0.0/Release/node-v83-darwin-x64.tar.gz (falling back to source compile with node-gyp) 
node-pre-gyp verb command build [ 'rebuild' ]
node-pre-gyp http Connection closed while downloading tarball file (falling back to source compile with node-gyp) 
node-pre-gyp verb command build [ 'rebuild' ]
  CXX(target) Release/obj.target/opencv/src/init.o
  CXX(target) Release/obj.target/opencv/src/init.o
sed: ./Release/.deps/Release/obj.target/opencv/src/init.o.d.raw: No such file or directory
  CXX(target) Release/obj.target/opencv/src/Matrix.o
rm: ./Release/.deps/Release/obj.target/opencv/src/init.o.d.raw: No such file or directory
make: *** [Release/obj.target/opencv/src/init.o] Error 1
gyp ERR! build error 
gyp ERR! stack Error: `make` failed with exit code: 2
gyp ERR! stack     at ChildProcess.onExit (/usr/local/lib/node_modules/npm/node_modules/node-gyp/lib/build.js:194:23)
gyp ERR! stack     at ChildProcess.emit (events.js:314:20)
gyp ERR! stack     at Process.ChildProcess._handle.onexit (internal/child_process.js:276:12)
gyp ERR! System Darwin 19.3.0
gyp ERR! command "/usr/local/Cellar/node/14.13.0/bin/node" "/usr/local/lib/node_modules/npm/node_modules/node-gyp/bin/node-gyp.js" "build" "--fallback-to-build" "--module=/Users/vai/Documents/jobs/Test/Brezaa/node_modules/faced/node_modules/opencv/build/opencv/v5.0.0/Release/node-v83-darwin-x64/opencv.node" "--module_name=opencv" "--module_path=/Users/vai/Documents/jobs/Test/Brezaa/node_modules/faced/node_modules/opencv/build/opencv/v5.0.0/Release/node-v83-darwin-x64"
gyp ERR! cwd /Users/vai/Documents/jobs/Test/Brezaa/node_modules/faced/node_modules/opencv
gyp ERR! node -v v14.13.0
gyp ERR! node-gyp -v v5.1.0
gyp ERR! not ok 
node-pre-gyp ERR! build error 
node-pre-gyp ERR! stack Error: Failed to execute '/usr/local/Cellar/node/14.13.0/bin/node /usr/local/lib/node_modules/npm/node_modules/node-gyp/bin/node-gyp.js build --fallback-to-build --module=/Users/vai/Documents/jobs/Test/Brezaa/node_modules/faced/node_modules/opencv/build/opencv/v5.0.0/Release/node-v83-darwin-x64/opencv.node --module_name=opencv --module_path=/Users/vai/Documents/jobs/Test/Brezaa/node_modules/faced/node_modules/opencv/build/opencv/v5.0.0/Release/node-v83-darwin-x64' (1)
node-pre-gyp ERR! stack     at ChildProcess.<anonymous> (/Users/vai/Documents/jobs/Test/Brezaa/node_modules/faced/node_modules/opencv/node_modules/node-pre-gyp/lib/util/compile.js:83:29)
node-pre-gyp ERR! stack     at ChildProcess.emit (events.js:314:20)
node-pre-gyp ERR! stack     at maybeClose (internal/child_process.js:1047:16)
node-pre-gyp ERR! stack     at Process.ChildProcess._handle.onexit (internal/child_process.js:287:5)
node-pre-gyp ERR! System Darwin 19.3.0
node-pre-gyp ERR! command "/usr/local/Cellar/node/14.13.0/bin/node" "/Users/vai/Documents/jobs/Test/Brezaa/node_modules/faced/node_modules/opencv/node_modules/.bin/node-pre-gyp" "install" "--fallback-to-build"
node-pre-gyp ERR! cwd /Users/vai/Documents/jobs/Test/Brezaa/node_modules/faced/node_modules/opencv
node-pre-gyp ERR! node -v v14.13.0
node-pre-gyp ERR! node-pre-gyp -v v0.6.17
node-pre-gyp ERR! not ok 
Failed to execute '/usr/local/Cellar/node/14.13.0/bin/node /usr/local/lib/node_modules/npm/node_modules/node-gyp/bin/node-gyp.js build --fallback-to-build --module=/Users/vai/Documents/jobs/Test/Brezaa/node_modules/faced/node_modules/opencv/build/opencv/v5.0.0/Release/node-v83-darwin-x64/opencv.node --module_name=opencv --module_path=/Users/vai/Documents/jobs/Test/Brezaa/node_modules/faced/node_modules/opencv/build/opencv/v5.0.0/Release/node-v83-darwin-x64' (1)
npm WARN brezaa@1.0.0 No repository field.

npm ERR! code ELIFECYCLE
npm ERR! errno 1
npm ERR! opencv@5.0.0 install: `node-pre-gyp install --fallback-to-build`
npm ERR! Exit status 1
npm ERR! 
npm ERR! Failed at the opencv@5.0.0 install script.
npm ERR! This is probably not a problem with npm. There is likely additional logging output above.

npm ERR! A complete log of this run can be found in:
npm ERR!     /Users/vai/.npm/_logs/2020-10-06T16_27_02_571Z-debug.log
(base) Vaishalis-MacBook-Pro:brezaa vai$ ../src/Matrix.cc:2:10: fatal error: 'Matrix.h' file not found
#include "Matrix.h"
         ^~~~~~~~~~
1 error generated.
make: *** [Release/obj.target/opencv/src/Matrix.o] Error 1
gyp ERR! build error 
gyp ERR! stack Error: `make` failed with exit code: 2
gyp ERR! stack     at ChildProcess.onExit (/usr/local/lib/node_modules/npm/node_modules/node-gyp/lib/build.js:194:23)
gyp ERR! stack     at ChildProcess.emit (events.js:314:20)
gyp ERR! stack     at Process.ChildProcess._handle.onexit (internal/child_process.js:276:12)
gyp ERR! System Darwin 19.3.0
gyp ERR! command "/usr/local/Cellar/node/14.13.0/bin/node" "/usr/local/lib/node_modules/npm/node_modules/node-gyp/bin/node-gyp.js" "build" "--fallback-to-build" "--module=/Users/vai/Documents/jobs/Test/Brezaa/node_modules/faced/node_modules/opencv/build/opencv/v5.0.0/Release/node-v83-darwin-x64/opencv.node" "--module_name=opencv" "--module_path=/Users/vai/Documents/jobs/Test/Brezaa/node_modules/faced/node_modules/opencv/build/opencv/v5.0.0/Release/node-v83-darwin-x64"
gyp ERR! cwd /Users/vai/Documents/jobs/Test/Brezaa/node_modules/faced/node_modules/opencv
gyp ERR! node -v v14.13.0
gyp ERR! node-gyp -v v5.1.0
gyp ERR! not ok 

package.json { “ name”:“ brezaa”, “ version”:“ 1.0.0”, “ description”:“”, “ main”:“ index.js”, “脚本”:{ “ start”:“节点index.js”, “ test”:“回显”错误:未指定测试“ &&退出1” }, “ author”:“”, “许可证”:“ ISC”, “依赖关系”:{ “ body-parser”:“ ^ 1.19.0”, “表达”:“ ^ 4.17.1”, “ node-pre-gyp”:“ ^ 0.15.0”, “ opencv”:“ github:peterbraden / node-opencv”, “路径”:“ ^ 0.12.7” } }

我做了以下事情: brew安装pkg-config opencv @ 2 brew链接opencv @ 2 --force npm install-面对

有人有什么想法吗?

0 个答案:

没有答案